{"text_format":"1","workbook":"xlsx","n_sheets":7,"sheets":["OHJE","Esimerkki TAPAHTUMAT","Esimerkki LASTEN LIIKUNTAKERHO","TAPAHTUMAT","KOONTISIVU","Parametrit","Mallijoukkue"],"not_rendered":{"charts":0,"images":0,"macros":1,"external_links":0,"defined_names":1,"comments":0,"pivot_tables":0},"unopened":[],"bounds":{"document_bytes":16777216,"sheet_cells":100000,"rows_first":2000,"rows_last":500,"rows_between":2000,"halvings":0,"cell_chars":16384,"cell_head_chars":4096},"cells_cut":0,"cells_raw":0,"read":"whole","date_system":"1900"}

{"sheet":"OHJE","index":0,"n_rows":0,"n_cols":0,"rows_kept":0,"cut":false,"hidden":false,"merged":[[0,0,1048575,16383]]}

{"sheet":"Esimerkki TAPAHTUMAT","index":1,"n_rows":159,"n_cols":7,"rows_kept":159,"cut":false,"hidden":false,"merged":[[157,0,158,0],[157,1,158,1],[148,0,149,0],[148,1,149,1],[151,0,152,0],[151,1,152,1],[154,0,155,0],[154,1,155,1],[139,0,140,0],[139,1,140,1],[142,0,143,0],[142,1,143,1],[145,0,146,0],[145,1,146,1],[130,0,131,0],[130,1,131,1],[133,0,134,0],[133,1,134,1],[136,0,137,0],[136,1,137,1],[121,0,122,0],[121,1,122,1],[124,0,125,0],[124,1,125,1],[127,0,128,0],[127,1,128,1],[112,0,113,0],[112,1,113,1],[115,0,116,0],[115,1,116,1],[118,0,119,0],[118,1,119,1],[103,0,104,0],[103,1,104,1],[106,0,107,0],[106,1,107,1],[109,0,110,0],[109,1,110,1],[94,0,95,0],[94,1,95,1],[97,0,98,0],[97,1,98,1],[100,0,101,0],[100,1,101,1],[85,0,86,0],[85,1,86,1],[88,0,89,0],[88,1,89,1],[91,0,92,0],[91,1,92,1],[76,0,77,0],[76,1,77,1],[79,0,80,0],[79,1,80,1],[82,0,83,0],[82,1,83,1],[67,0,68,0],[67,1,68,1],[70,0,71,0],[70,1,71,1],[73,0,74,0],[73,1,74,1],[58,0,59,0],[58,1,59,1],[61,0,62,0],[61,1,62,1],[64,0,65,0],[64,1,65,1],[49,0,50,0],[49,1,50,1],[52,0,53,0],[52,1,53,1],[55,0,56,0],[55,1,56,1],[40,0,41,0],[40,1,41,1],[43,0,44,0],[43,1,44,1],[46,0,47,0],[46,1,47,1],[31,0,32,0],[31,1,32,1],[34,0,35,0],[34,1,35,1],[37,0,38,0],[37,1,38,1],[22,1,23,1],[25,0,26,0],[25,1,26,1],[28,0,29,0],[28,1,29,1],[13,0,14,0],[13,1,14,1],[1,0,1,1],[16,0,17,0],[16,1,17,1],[4,0,5,0],[4,1,5,1],[7,0,8,0],[7,1,8,1],[10,0,11,0],[10,1,11,1],[19,0,20,0],[19,1,20,1],[22,0,23,0]]}
["YHDISTYS: "]
["Naantalin seuratyö ry",null,null,null,null,"YHTEENSÄ",{"$f":"SUM(G4:G159)","v":102}]
["TOIMINTAVUOSI:  ","2021","LAPSET (0-12v.)","NUORET (13-19v.)","AIKUISET (20v.->)","ERITYISRYHMÄ"]
["Paikka ja pvm","Tapahtuman tiedot",2,3,1,4,"KERROIN"]
["Kuparivuoren kenttä, 7.5.2021","Juoksukilpailut, Veera Vastuullinen",23,12,8,3,"YHTEENSÄ (pistettä)"]
[null,null,{"$f":"C4*C5","v":46},{"$f":"D4*D5","v":36},8,12,{"$f":"SUM(C6:F6)","v":102}]
["Paikka ja pvm","Tapahtuman tiedot",2,3,1,4,"KERROIN"]
[null,null,null,null,null,null,"YHTEENSÄ (pistettä)"]
[null,null,{"$f":"C7*C8","v":0},0,0,0,{"$f":"SUM(C9:F9)","v":0}]
["Paikka ja pvm","Tapahtuman tiedot",2,3,1,4,"KERROIN"]
[null,null,null,null,null,null,"YHTEENSÄ (pistettä)"]
[null,null,{"$f":"C10*C11","v":0},0,0,0,{"$f":"SUM(C12:F12)","v":0}]
["Paikka ja pvm","Tapahtuman tiedot",2,3,1,4,"KERROIN"]
[null,null,null,null,null,null,"YHTEENSÄ (pistettä)"]
[null,null,{"$f":"C13*C14","v":0},0,0,0,{"$f":"SUM(C15:F15)","v":0}]
["Paikka ja pvm","Tapahtuman tiedot",2,3,1,4,"KERROIN"]
[null,null,null,null,null,null,"YHTEENSÄ (pistettä)"]
[null,null,{"$f":"C16*C17","v":0},0,0,0,{"$f":"SUM(C18:F18)","v":0}]
["Paikka ja pvm","Tapahtuman tiedot",2,3,1,4,"KERROIN"]
[null,null,null,null,null,null,"YHTEENSÄ (pistettä)"]
[null,null,{"$f":"C19*C20","v":0},0,0,0,{"$f":"SUM(C21:F21)","v":0}]
["Paikka ja pvm","Tapahtuman tiedot",2,3,1,4,"KERROIN"]
[null,null,null,null,null,null,"YHTEENSÄ (pistettä)"]
[null,null,{"$f":"C22*C23","v":0},0,0,0,{"$f":"SUM(C24:F24)","v":0}]
["Paikka ja pvm","Tapahtuman tiedot",2,3,1,4,"KERROIN"]
[null,null,null,null,null,null,"YHTEENSÄ (pistettä)"]
[null,null,{"$f":"C25*C26","v":0},0,0,0,{"$f":"SUM(C27:F27)","v":0}]
["Paikka ja pvm","Tapahtuman tiedot",2,3,1,4,"KERROIN"]
[null,null,null,null,null,null,"YHTEENSÄ (pistettä)"]
[null,null,{"$f":"C28*C29","v":0},0,0,0,{"$f":"SUM(C30:F30)","v":0}]
["Paikka ja pvm","Tapahtuman tiedot",2,3,1,4,"KERROIN"]
[null,null,null,null,null,null,"YHTEENSÄ (pistettä)"]
[null,null,{"$f":"C31*C32","v":0},0,0,0,{"$f":"SUM(C33:F33)","v":0}]
["Paikka ja pvm","Tapahtuman tiedot",2,3,1,4,"KERROIN"]
[null,null,null,null,null,null,"YHTEENSÄ (pistettä)"]
[null,null,{"$f":"C34*C35","v":0},0,0,0,{"$f":"SUM(C36:F36)","v":0}]
["Paikka ja pvm","Tapahtuman tiedot",2,3,1,4,"KERROIN"]
[null,null,null,null,null,null,"YHTEENSÄ (pistettä)"]
[null,null,{"$f":"C37*C38","v":0},0,0,0,{"$f":"SUM(C39:F39)","v":0}]
["Paikka ja pvm","Tapahtuman tiedot",2,3,1,4,"KERROIN"]
[null,null,null,null,null,null,"YHTEENSÄ (pistettä)"]
[null,null,{"$f":"C40*C41","v":0},0,0,0,{"$f":"SUM(C42:F42)","v":0}]
["Paikka ja pvm","Tapahtuman tiedot",2,3,1,4,"KERROIN"]
[null,null,null,null,null,null,"YHTEENSÄ (pistettä)"]
[null,null,{"$f":"C43*C44","v":0},0,0,0,{"$f":"SUM(C45:F45)","v":0}]
["Paikka ja pvm","Tapahtuman tiedot",2,3,1,4,"KERROIN"]
[null,null,null,null,null,null,"YHTEENSÄ (pistettä)"]
[null,null,{"$f":"C46*C47","v":0},0,0,0,{"$f":"SUM(C48:F48)","v":0}]
["Paikka ja pvm","Tapahtuman tiedot",2,3,1,4,"KERROIN"]
[null,null,null,null,null,null,"YHTEENSÄ (pistettä)"]
[null,null,{"$f":"C49*C50","v":0},0,0,0,{"$f":"SUM(C51:F51)","v":0}]
["Paikka ja pvm","Tapahtuman tiedot",2,3,1,4,"KERROIN"]
[null,null,null,null,null,null,"YHTEENSÄ (pistettä)"]
[null,null,{"$f":"C52*C53","v":0},0,0,0,{"$f":"SUM(C54:F54)","v":0}]
["Paikka ja pvm","Tapahtuman tiedot",2,3,1,4,"KERROIN"]
[null,null,null,null,null,null,"YHTEENSÄ (pistettä)"]
[null,null,{"$f":"C55*C56","v":0},0,0,0,{"$f":"SUM(C57:F57)","v":0}]
["Paikka ja pvm","Tapahtuman tiedot",2,3,1,4,"KERROIN"]
[null,null,null,null,null,null,"YHTEENSÄ (pistettä)"]
[null,null,{"$f":"C58*C59","v":0},0,0,0,{"$f":"SUM(C60:F60)","v":0}]
["Paikka ja pvm","Tapahtuman tiedot",2,3,1,4,"KERROIN"]
[null,null,null,null,null,null,"YHTEENSÄ (pistettä)"]
[null,null,{"$f":"C61*C62","v":0},0,0,0,{"$f":"SUM(C63:F63)","v":0}]
["Paikka ja pvm","Tapahtuman tiedot",2,3,1,4,"KERROIN"]
[null,null,null,null,null,null,"YHTEENSÄ (pistettä)"]
[null,null,{"$f":"C64*C65","v":0},0,0,0,{"$f":"SUM(C66:F66)","v":0}]
["Paikka ja pvm","Tapahtuman tiedot",2,3,1,4,"KERROIN"]
[null,null,null,null,null,null,"YHTEENSÄ (pistettä)"]
[null,null,{"$f":"C67*C68","v":0},0,0,0,{"$f":"SUM(C69:F69)","v":0}]
["Paikka ja pvm","Tapahtuman tiedot",2,3,1,4,"KERROIN"]
[null,null,null,null,null,null,"YHTEENSÄ (pistettä)"]
[null,null,{"$f":"C70*C71","v":0},0,0,0,{"$f":"SUM(C72:F72)","v":0}]
["Paikka ja pvm","Tapahtuman tiedot",2,3,1,4,"KERROIN"]
[null,null,null,null,null,null,"YHTEENSÄ (pistettä)"]
[null,null,{"$f":"C73*C74","v":0},0,0,0,{"$f":"SUM(C75:F75)","v":0}]
["Paikka ja pvm","Tapahtuman tiedot",2,3,1,4,"KERROIN"]
[null,null,null,null,null,null,"YHTEENSÄ (pistettä)"]
[null,null,{"$f":"C76*C77","v":0},0,0,0,{"$f":"SUM(C78:F78)","v":0}]
["Paikka ja pvm","Tapahtuman tiedot",2,3,1,4,"KERROIN"]
[null,null,null,null,null,null,"YHTEENSÄ (pistettä)"]
[null,null,{"$f":"C79*C80","v":0},0,0,0,{"$f":"SUM(C81:F81)","v":0}]
["Paikka ja pvm","Tapahtuman tiedot",2,3,1,4,"KERROIN"]
[null,null,null,null,null,null,"YHTEENSÄ (pistettä)"]
[null,null,{"$f":"C82*C83","v":0},0,0,0,{"$f":"SUM(C84:F84)","v":0}]
["Paikka ja pvm","Tapahtuman tiedot",2,3,1,4,"KERROIN"]
[null,null,null,null,null,null,"YHTEENSÄ (pistettä)"]
[null,null,{"$f":"C85*C86","v":0},0,0,0,{"$f":"SUM(C87:F87)","v":0}]
["Paikka ja pvm","Tapahtuman tiedot",2,3,1,4,"KERROIN"]
[null,null,null,null,null,null,"YHTEENSÄ (pistettä)"]
[null,null,{"$f":"C88*C89","v":0},0,0,0,{"$f":"SUM(C90:F90)","v":0}]
["Paikka ja pvm","Tapahtuman tiedot",2,3,1,4,"KERROIN"]
[null,null,null,null,null,null,"YHTEENSÄ (pistettä)"]
[null,null,{"$f":"C91*C92","v":0},0,0,0,{"$f":"SUM(C93:F93)","v":0}]
["Paikka ja pvm","Tapahtuman tiedot",2,3,1,4,"KERROIN"]
[null,null,null,null,null,null,"YHTEENSÄ (pistettä)"]
[null,null,{"$f":"C94*C95","v":0},0,0,0,{"$f":"SUM(C96:F96)","v":0}]
["Paikka ja pvm","Tapahtuman tiedot",2,3,1,4,"KERROIN"]
[null,null,null,null,null,null,"YHTEENSÄ (pistettä)"]
[null,null,{"$f":"C97*C98","v":0},0,0,0,{"$f":"SUM(C99:F99)","v":0}]
["Paikka ja pvm","Tapahtuman tiedot",2,3,1,4,"KERROIN"]
[null,null,null,null,null,null,"YHTEENSÄ (pistettä)"]
[null,null,{"$f":"C100*C101","v":0},0,0,0,{"$f":"SUM(C102:F102)","v":0}]
["Paikka ja pvm","Tapahtuman tiedot",2,3,1,4,"KERROIN"]
[null,null,null,null,null,null,"YHTEENSÄ (pistettä)"]
[null,null,{"$f":"C103*C104","v":0},0,0,0,{"$f":"SUM(C105:F105)","v":0}]
["Paikka ja pvm","Tapahtuman tiedot",2,3,1,4,"KERROIN"]
[null,null,null,null,null,null,"YHTEENSÄ (pistettä)"]
[null,null,{"$f":"C106*C107","v":0},0,0,0,{"$f":"SUM(C108:F108)","v":0}]
["Paikka ja pvm","Tapahtuman tiedot",2,3,1,4,"KERROIN"]
[null,null,null,null,null,null,"YHTEENSÄ (pistettä)"]
[null,null,{"$f":"C109*C110","v":0},0,0,0,{"$f":"SUM(C111:F111)","v":0}]
["Paikka ja pvm","Tapahtuman tiedot",2,3,1,4,"KERROIN"]
[null,null,null,null,null,null,"YHTEENSÄ (pistettä)"]
[null,null,{"$f":"C112*C113","v":0},0,0,0,{"$f":"SUM(C114:F114)","v":0}]
["Paikka ja pvm","Tapahtuman tiedot",2,3,1,4,"KERROIN"]
[null,null,null,null,null,null,"YHTEENSÄ (pistettä)"]
[null,null,{"$f":"C115*C116","v":0},0,0,0,{"$f":"SUM(C117:F117)","v":0}]
["Paikka ja pvm","Tapahtuman tiedot",2,3,1,4,"KERROIN"]
[null,null,null,null,null,null,"YHTEENSÄ (pistettä)"]
[null,null,{"$f":"C118*C119","v":0},0,0,0,{"$f":"SUM(C120:F120)","v":0}]
{"$rows_left_out":40}
{"sheet":"Esimerkki LASTEN LIIKUNTAKERHO","index":2,"n_rows":18,"n_cols":11,"rows_kept":18,"cut":false,"hidden":false,"merged":[[4,8,4,9],[5,1,6,1],[4,2,4,3],[4,4,4,5],[4,6,4,7]]}
["YHDISTYS/SEURA/JAOSTO: ","Naantalin seuratyö ry"]
["TOIMINTAVUOSI: ",2021]
["TOIMINTARYHMÄ:","LASTEN LIIKUNTAKERHO"]
["OHJAAJA:","Ville Valmentaja"]
[null,"VIIKKO",1,null,2,null,3,null,52]
[null,null,"PVM","PVM","PVM","PVM","PVM","PVM","PVM","PVM"]
[null,null,"8.5.","10.5."]
["KERROINRYHMÄ: ","KERROINLUKU:"]
["Nuoret (13-19v)",{"$f":"VLOOKUP(A9,Parametrit!A1:B5,2,FALSE)","v":3}]
["OSALLISTUJAN NIMI","SYNTYMÄVUOSI"]
["Hilla Hiihtäjä",2005,1]
["Pekka Palloilija",2004]
["Päivi Partiolainen",2005,1]
[]
[]
[]
[null,null,null,null,null,null,null,null,null,null,"YHTEENSÄ"]
[null,"Yhteensä",{"$f":"SUM(C10:C17)","v":2},0,0,0,0,0,0,0,{"$f":"SUM(C18:J18)*B9","v":6}]

{"sheet":"TAPAHTUMAT","index":3,"n_rows":159,"n_cols":7,"rows_kept":159,"cut":false,"hidden":false,"merged":[[151,0,152,0],[151,1,152,1],[154,0,155,0],[154,1,155,1],[157,0,158,0],[157,1,158,1],[142,0,143,0],[142,1,143,1],[145,0,146,0],[145,1,146,1],[148,0,149,0],[148,1,149,1],[133,0,134,0],[133,1,134,1],[136,0,137,0],[136,1,137,1],[139,0,140,0],[139,1,140,1],[124,0,125,0],[124,1,125,1],[127,0,128,0],[127,1,128,1],[130,0,131,0],[130,1,131,1],[115,0,116,0],[115,1,116,1],[118,0,119,0],[118,1,119,1],[121,0,122,0],[121,1,122,1],[106,0,107,0],[106,1,107,1],[109,0,110,0],[109,1,110,1],[112,0,113,0],[112,1,113,1],[97,0,98,0],[97,1,98,1],[100,0,101,0],[100,1,101,1],[103,0,104,0],[103,1,104,1],[88,0,89,0],[88,1,89,1],[91,0,92,0],[91,1,92,1],[94,0,95,0],[94,1,95,1],[79,0,80,0],[79,1,80,1],[82,0,83,0],[82,1,83,1],[85,0,86,0],[85,1,86,1],[70,0,71,0],[70,1,71,1],[73,0,74,0],[73,1,74,1],[76,0,77,0],[76,1,77,1],[61,0,62,0],[61,1,62,1],[64,0,65,0],[64,1,65,1],[67,0,68,0],[67,1,68,1],[52,0,53,0],[52,1,53,1],[55,0,56,0],[55,1,56,1],[58,0,59,0],[58,1,59,1],[43,0,44,0],[43,1,44,1],[46,0,47,0],[46,1,47,1],[49,0,50,0],[49,1,50,1],[34,0,35,0],[34,1,35,1],[37,0,38,0],[37,1,38,1],[40,0,41,0],[40,1,41,1],[1,0,1,1],[4,0,5,0],[4,1,5,1],[7,0,8,0],[25,0,26,0],[25,1,26,1],[28,0,29,0],[28,1,29,1],[31,0,32,0],[31,1,32,1],[7,1,8,1],[19,0,20,0],[19,1,20,1],[22,0,23,0],[22,1,23,1],[10,0,11,0],[10,1,11,1],[13,0,14,0],[13,1,14,1],[16,0,17,0],[16,1,17,1]]}
["SEURA: "]
[null,null,null,null,null,"YHTEENSÄ",{"$f":"SUM(G4:G159)","v":0}]
["TOIMINTAVUOSI:  ","2021","LAPSET (0-12v.)","NUORET (13-19v.)","AIKUISET (20v.->)","ERITYISRYHMÄ"]
["Paikka ja pvm",null,2,3,1,4,"KERROIN"]
[null,null,null,null,null,null,"YHTEENSÄ (pistettä)"]
[null,null,{"$f":"C4*C5","v":0},{"$f":"D4*D5","v":0},0,0,{"$f":"SUM(C6:F6)","v":0}]
["Paikka ja pvm","Tapahtuman tiedot",2,3,1,4,"KERROIN"]
[null,null,null,null,null,null,"YHTEENSÄ (pistettä)"]
[null,null,{"$f":"C7*C8","v":0},{"$f":"D7*D8","v":0},0,{"$f":"F7*F8","v":0},{"$f":"SUM(C9:F9)","v":0}]
["Paikka ja pvm","Tapahtuman tiedot",2,3,1,4,"KERROIN"]
[null,null,null,null,null,null,"YHTEENSÄ (pistettä)"]
[null,null,{"$f":"C10*C11","v":0},{"$f":"D10*D11","v":0},{"$f":"E10*E11","v":0},{"$f":"F10*F11","v":0},{"$f":"SUM(C12:F12)","v":0}]
["Paikka ja pvm","Tapahtuman tiedot",2,3,1,4,"KERROIN"]
[null,null,null,null,null,null,"YHTEENSÄ (pistettä)"]
[null,null,{"$f":"C13*C14","v":0},{"$f":"D13*D14","v":0},{"$f":"E13*E14","v":0},{"$f":"F13*F14","v":0},{"$f":"SUM(C15:F15)","v":0}]
["Paikka ja pvm","Tapahtuman tiedot",2,3,1,4,"KERROIN"]
[null,null,null,null,null,null,"YHTEENSÄ (pistettä)"]
[null,null,{"$f":"C16*C17","v":0},{"$f":"D16*D17","v":0},{"$f":"E16*E17","v":0},{"$f":"F16*F17","v":0},{"$f":"SUM(C18:F18)","v":0}]
["Paikka ja pvm","Tapahtuman tiedot",2,3,1,4,"KERROIN"]
[null,null,null,null,null,null,"YHTEENSÄ (pistettä)"]
[null,null,{"$f":"C19*C20","v":0},{"$f":"D19*D20","v":0},{"$f":"E19*E20","v":0},{"$f":"F19*F20","v":0},{"$f":"SUM(C21:F21)","v":0}]
["Paikka ja pvm","Tapahtuman tiedot",2,3,1,4,"KERROIN"]
[null,null,null,null,null,null,"YHTEENSÄ (pistettä)"]
[null,null,{"$f":"C22*C23","v":0},{"$f":"D22*D23","v":0},{"$f":"E22*E23","v":0},{"$f":"F22*F23","v":0},{"$f":"SUM(C24:F24)","v":0}]
["Paikka ja pvm","Tapahtuman tiedot",2,3,1,4,"KERROIN"]
[null,null,null,null,null,null,"YHTEENSÄ (pistettä)"]
[null,null,{"$f":"C25*C26","v":0},{"$f":"D25*D26","v":0},{"$f":"E25*E26","v":0},{"$f":"F25*F26","v":0},{"$f":"SUM(C27:F27)","v":0}]
["Paikka ja pvm","Tapahtuman tiedot",2,3,1,4,"KERROIN"]
[null,null,null,null,null,null,"YHTEENSÄ (pistettä)"]
[null,null,{"$f":"C28*C29","v":0},{"$f":"D28*D29","v":0},{"$f":"E28*E29","v":0},{"$f":"F28*F29","v":0},{"$f":"SUM(C30:F30)","v":0}]
["Paikka ja pvm","Tapahtuman tiedot",2,3,1,4,"KERROIN"]
[null,null,null,null,null,null,"YHTEENSÄ (pistettä)"]
[null,null,{"$f":"C31*C32","v":0},{"$f":"D31*D32","v":0},{"$f":"E31*E32","v":0},{"$f":"F31*F32","v":0},{"$f":"SUM(C33:F33)","v":0}]
["Paikka ja pvm","Tapahtuman tiedot",2,3,1,4,"KERROIN"]
[null,null,null,null,null,null,"YHTEENSÄ (pistettä)"]
[null,null,{"$f":"C34*C35","v":0},{"$f":"D34*D35","v":0},{"$f":"E34*E35","v":0},{"$f":"F34*F35","v":0},{"$f":"SUM(C36:F36)","v":0}]
["Paikka ja pvm","Tapahtuman tiedot",2,3,1,4,"KERROIN"]
[null,null,null,null,null,null,"YHTEENSÄ (pistettä)"]
[null,null,{"$f":"C37*C38","v":0},{"$f":"D37*D38","v":0},{"$f":"E37*E38","v":0},{"$f":"F37*F38","v":0},{"$f":"SUM(C39:F39)","v":0}]
["Paikka ja pvm","Tapahtuman tiedot",2,3,1,4,"KERROIN"]
[null,null,null,null,null,null,"YHTEENSÄ (pistettä)"]
[null,null,{"$f":"C40*C41","v":0},{"$f":"D40*D41","v":0},{"$f":"E40*E41","v":0},{"$f":"F40*F41","v":0},{"$f":"SUM(C42:F42)","v":0}]
["Paikka ja pvm","Tapahtuman tiedot",2,3,1,4,"KERROIN"]
[null,null,null,null,null,null,"YHTEENSÄ (pistettä)"]
[null,null,{"$f":"C43*C44","v":0},{"$f":"D43*D44","v":0},{"$f":"E43*E44","v":0},{"$f":"F43*F44","v":0},{"$f":"SUM(C45:F45)","v":0}]
["Paikka ja pvm","Tapahtuman tiedot",2,3,1,4,"KERROIN"]
[null,null,null,null,null,null,"YHTEENSÄ (pistettä)"]
[null,null,{"$f":"C46*C47","v":0},{"$f":"D46*D47","v":0},{"$f":"E46*E47","v":0},{"$f":"F46*F47","v":0},{"$f":"SUM(C48:F48)","v":0}]
["Paikka ja pvm","Tapahtuman tiedot",2,3,1,4,"KERROIN"]
[null,null,null,null,null,null,"YHTEENSÄ (pistettä)"]
[null,null,{"$f":"C49*C50","v":0},{"$f":"D49*D50","v":0},{"$f":"E49*E50","v":0},{"$f":"F49*F50","v":0},{"$f":"SUM(C51:F51)","v":0}]
["Paikka ja pvm","Tapahtuman tiedot",2,3,1,4,"KERROIN"]
[null,null,null,null,null,null,"YHTEENSÄ (pistettä)"]
[null,null,{"$f":"C52*C53","v":0},{"$f":"D52*D53","v":0},{"$f":"E52*E53","v":0},{"$f":"F52*F53","v":0},{"$f":"SUM(C54:F54)","v":0}]
["Paikka ja pvm","Tapahtuman tiedot",2,3,1,4,"KERROIN"]
[null,null,null,null,null,null,"YHTEENSÄ (pistettä)"]
[null,null,{"$f":"C55*C56","v":0},{"$f":"D55*D56","v":0},{"$f":"E55*E56","v":0},{"$f":"F55*F56","v":0},{"$f":"SUM(C57:F57)","v":0}]
["Paikka ja pvm","Tapahtuman tiedot",2,3,1,4,"KERROIN"]
[null,null,null,null,null,null,"YHTEENSÄ (pistettä)"]
[null,null,{"$f":"C58*C59","v":0},{"$f":"D58*D59","v":0},{"$f":"E58*E59","v":0},{"$f":"F58*F59","v":0},{"$f":"SUM(C60:F60)","v":0}]
["Paikka ja pvm","Tapahtuman tiedot",2,3,1,4,"KERROIN"]
[null,null,null,null,null,null,"YHTEENSÄ (pistettä)"]
[null,null,{"$f":"C61*C62","v":0},{"$f":"D61*D62","v":0},{"$f":"E61*E62","v":0},{"$f":"F61*F62","v":0},{"$f":"SUM(C63:F63)","v":0}]
["Paikka ja pvm","Tapahtuman tiedot",2,3,1,4,"KERROIN"]
[null,null,null,null,null,null,"YHTEENSÄ (pistettä)"]
[null,null,{"$f":"C64*C65","v":0},{"$f":"D64*D65","v":0},{"$f":"E64*E65","v":0},{"$f":"F64*F65","v":0},{"$f":"SUM(C66:F66)","v":0}]
["Paikka ja pvm","Tapahtuman tiedot",2,3,1,4,"KERROIN"]
[null,null,null,null,null,null,"YHTEENSÄ (pistettä)"]
[null,null,{"$f":"C67*C68","v":0},{"$f":"D67*D68","v":0},{"$f":"E67*E68","v":0},{"$f":"F67*F68","v":0},{"$f":"SUM(C69:F69)","v":0}]
["Paikka ja pvm","Tapahtuman tiedot",2,3,1,4,"KERROIN"]
[null,null,null,null,null,null,"YHTEENSÄ (pistettä)"]
[null,null,{"$f":"C70*C71","v":0},{"$f":"D70*D71","v":0},{"$f":"E70*E71","v":0},{"$f":"F70*F71","v":0},{"$f":"SUM(C72:F72)","v":0}]
["Paikka ja pvm","Tapahtuman tiedot",2,3,1,4,"KERROIN"]
[null,null,null,null,null,null,"YHTEENSÄ (pistettä)"]
[null,null,{"$f":"C73*C74","v":0},{"$f":"D73*D74","v":0},{"$f":"E73*E74","v":0},{"$f":"F73*F74","v":0},{"$f":"SUM(C75:F75)","v":0}]
["Paikka ja pvm","Tapahtuman tiedot",2,3,1,4,"KERROIN"]
[null,null,null,null,null,null,"YHTEENSÄ (pistettä)"]
[null,null,{"$f":"C76*C77","v":0},{"$f":"D76*D77","v":0},{"$f":"E76*E77","v":0},{"$f":"F76*F77","v":0},{"$f":"SUM(C78:F78)","v":0}]
["Paikka ja pvm","Tapahtuman tiedot",2,3,1,4,"KERROIN"]
[null,null,null,null,null,null,"YHTEENSÄ (pistettä)"]
[null,null,{"$f":"C79*C80","v":0},{"$f":"D79*D80","v":0},{"$f":"E79*E80","v":0},{"$f":"F79*F80","v":0},{"$f":"SUM(C81:F81)","v":0}]
["Paikka ja pvm","Tapahtuman tiedot",2,3,1,4,"KERROIN"]
[null,null,null,null,null,null,"YHTEENSÄ (pistettä)"]
[null,null,{"$f":"C82*C83","v":0},{"$f":"D82*D83","v":0},{"$f":"E82*E83","v":0},{"$f":"F82*F83","v":0},{"$f":"SUM(C84:F84)","v":0}]
["Paikka ja pvm","Tapahtuman tiedot",2,3,1,4,"KERROIN"]
[null,null,null,null,null,null,"YHTEENSÄ (pistettä)"]
[null,null,{"$f":"C85*C86","v":0},{"$f":"D85*D86","v":0},{"$f":"E85*E86","v":0},{"$f":"F85*F86","v":0},{"$f":"SUM(C87:F87)","v":0}]
["Paikka ja pvm","Tapahtuman tiedot",2,3,1,4,"KERROIN"]
[null,null,null,null,null,null,"YHTEENSÄ (pistettä)"]
[null,null,{"$f":"C88*C89","v":0},{"$f":"D88*D89","v":0},{"$f":"E88*E89","v":0},{"$f":"F88*F89","v":0},{"$f":"SUM(C90:F90)","v":0}]
["Paikka ja pvm","Tapahtuman tiedot",2,3,1,4,"KERROIN"]
[null,null,null,null,null,null,"YHTEENSÄ (pistettä)"]
[null,null,{"$f":"C91*C92","v":0},{"$f":"D91*D92","v":0},{"$f":"E91*E92","v":0},{"$f":"F91*F92","v":0},{"$f":"SUM(C93:F93)","v":0}]
["Paikka ja pvm","Tapahtuman tiedot",2,3,1,4,"KERROIN"]
[null,null,null,null,null,null,"YHTEENSÄ (pistettä)"]
[null,null,{"$f":"C94*C95","v":0},{"$f":"D94*D95","v":0},{"$f":"E94*E95","v":0},{"$f":"F94*F95","v":0},{"$f":"SUM(C96:F96)","v":0}]
["Paikka ja pvm","Tapahtuman tiedot",2,3,1,4,"KERROIN"]
[null,null,null,null,null,null,"YHTEENSÄ (pistettä)"]
[null,null,{"$f":"C97*C98","v":0},{"$f":"D97*D98","v":0},{"$f":"E97*E98","v":0},{"$f":"F97*F98","v":0},{"$f":"SUM(C99:F99)","v":0}]
["Paikka ja pvm","Tapahtuman tiedot",2,3,1,4,"KERROIN"]
[null,null,null,null,null,null,"YHTEENSÄ (pistettä)"]
[null,null,{"$f":"C100*C101","v":0},{"$f":"D100*D101","v":0},{"$f":"E100*E101","v":0},{"$f":"F100*F101","v":0},{"$f":"SUM(C102:F102)","v":0}]
["Paikka ja pvm","Tapahtuman tiedot",2,3,1,4,"KERROIN"]
[null,null,null,null,null,null,"YHTEENSÄ (pistettä)"]
[null,null,{"$f":"C103*C104","v":0},{"$f":"D103*D104","v":0},{"$f":"E103*E104","v":0},{"$f":"F103*F104","v":0},{"$f":"SUM(C105:F105)","v":0}]
["Paikka ja pvm","Tapahtuman tiedot",2,3,1,4,"KERROIN"]
[null,null,null,null,null,null,"YHTEENSÄ (pistettä)"]
[null,null,{"$f":"C106*C107","v":0},{"$f":"D106*D107","v":0},{"$f":"E106*E107","v":0},{"$f":"F106*F107","v":0},{"$f":"SUM(C108:F108)","v":0}]
["Paikka ja pvm","Tapahtuman tiedot",2,3,1,4,"KERROIN"]
[null,null,null,null,null,null,"YHTEENSÄ (pistettä)"]
[null,null,{"$f":"C109*C110","v":0},{"$f":"D109*D110","v":0},{"$f":"E109*E110","v":0},{"$f":"F109*F110","v":0},{"$f":"SUM(C111:F111)","v":0}]
["Paikka ja pvm","Tapahtuman tiedot",2,3,1,4,"KERROIN"]
[null,null,null,null,null,null,"YHTEENSÄ (pistettä)"]
[null,null,{"$f":"C112*C113","v":0},{"$f":"D112*D113","v":0},{"$f":"E112*E113","v":0},{"$f":"F112*F113","v":0},{"$f":"SUM(C114:F114)","v":0}]
["Paikka ja pvm","Tapahtuman tiedot",2,3,1,4,"KERROIN"]
[null,null,null,null,null,null,"YHTEENSÄ (pistettä)"]
[null,null,{"$f":"C115*C116","v":0},{"$f":"D115*D116","v":0},{"$f":"E115*E116","v":0},{"$f":"F115*F116","v":0},{"$f":"SUM(C117:F117)","v":0}]
["Paikka ja pvm","Tapahtuman tiedot",2,3,1,4,"KERROIN"]
[null,null,null,null,null,null,"YHTEENSÄ (pistettä)"]
[null,null,{"$f":"C118*C119","v":0},{"$f":"D118*D119","v":0},{"$f":"E118*E119","v":0},{"$f":"F118*F119","v":0},{"$f":"SUM(C120:F120)","v":0}]
{"$rows_left_out":40}
{"sheet":"KOONTISIVU","index":4,"n_rows":17,"n_cols":154,"rows_kept":17,"cut":false,"hidden":false,"merged":[[1,2,1,4]]}
[]
[null,"Yhdistys/seura/jaosto"]
[null,"Joukkueiden pisteet  ",null,null,{"$f":"SUM(E8:E500)","v":0}]
[null,"Tapahtumien pisteet ",null,null,{"$f":"TAPAHTUMAT!G2","v":0}]
[null,"Yhteensä",null,null,{"$f":"E3+E4","v":0}," "]
[]
[null,"Joukkue","Ohjaaja","Kerroinryhmä","Pisteet yhteensä"]
[]
[]
[]
[]
[]
[]
[]
[]
[]
[null,null,null,null,null,null,null,null,null,null,null,null,null,null,null,null,null,null,null,null,null,null,null,null,null,null,null,null,null,null,null,null,null,null,null,null,null,null,null,null,null,null,null,null,null,null,null,null,null,null,null,null,null,null,null,null,null,null,null,null,null,null,null,null,null,null,null,null,null,null,null,null,null,null,null,null,null,null,null,null,null,null,null,null,null,null,null,null,null,null,null,null,null,null,null,null,null,null,null,null,null,null,null,null,null,null,null,null,null,null,null,null,null,null,null,null,null,null,null,null,null,null,null,null,null,null,null,null,null,null,null,null,null,null,null,null,null,null,null,null,null,null,null,null,null,null,null,null,null,null,null,null,null,{"$f":"KOONTISIVU!#REF!=SUM(D17:EW17)","v":{"$error":"#REF!"}}]

{"sheet":"Parametrit","index":5,"n_rows":5,"n_cols":2,"rows_kept":5,"cut":false,"hidden":true,"merged":[]}
["Kerroinryhmä","Pisteet"]
["Lapset (0-12v)",2]
["Nuoret (13-19v)",3]
["Aikuiset",1]
["Erityisryhmä",4]

{"sheet":"Mallijoukkue","index":6,"n_rows":48,"n_cols":107,"rows_kept":48,"cut":false,"hidden":true,"merged":[[4,44,4,45],[4,46,4,47],[4,48,4,49],[4,50,4,51],[4,52,4,53],[4,104,4,105],[4,100,4,101],[4,102,4,103],[4,78,4,79],[4,56,4,57],[4,58,4,59],[4,60,4,61],[4,62,4,63],[4,64,4,65],[4,66,4,67],[4,92,4,93],[4,94,4,95],[4,96,4,97],[4,98,4,99],[4,42,4,43],[4,2,4,3],[4,4,4,5],[4,6,4,7],[4,30,4,31],[4,8,4,9],[4,10,4,11],[4,12,4,13],[4,14,4,15],[4,16,4,17],[4,18,4,19],[4,20,4,21],[4,22,4,23],[4,24,4,25],[4,26,4,27],[4,28,4,29],[4,32,4,33],[4,34,4,35],[4,36,4,37],[4,38,4,39],[4,40,4,41],[4,54,4,55],[4,90,4,91],[4,68,4,69],[4,70,4,71],[4,72,4,73],[4,74,4,75],[4,76,4,77],[4,80,4,81],[4,82,4,83],[4,84,4,85],[4,86,4,87],[4,88,4,89]]}
["YHDISTYS/SEURA/JAOSTO: "]
["TOIMINTAVUOSI: ",2021]
["TOIMINTARYHMÄ:"]
["OHJAAJA:"]
["KERROINRYHMÄ: ","KERROINLUKU:",1,null,2,null,3,null,4,null,5,null,6,null,7,null,8,null,9,null,10,null,11,null,12,null,13,null,14,null,15,null,16,null,17,null,18,null,19,null,20,null,21,null,22,null,23,null,24,null,25,null,26,null,27,null,28,null,29,null,30,null,31,null,32,null,33,null,34,null,35,null,36,null,37,null,38,null,39,null,40,null,41,null,42,null,43,null,44,null,45,null,46,null,47,null,48,null,49,null,50,null,51,null,52]
[null,{"$f":"VLOOKUP(A6,Parametrit!A1:B5,2,FALSE)","v":{"$error":"#N/A"}},"PVM","PVM","PVM","PVM","PVM","PVM","PVM","PVM","PVM","PVM","PVM","PVM","PVM","PVM","PVM","PVM","PVM","PVM","PVM","PVM","PVM","PVM","PVM","PVM","PVM","PVM","PVM","PVM","PVM","PVM","PVM","PVM","PVM","PVM","PVM","PVM","PVM","PVM","PVM","PVM","PVM","PVM","PVM","PVM","PVM","PVM","PVM","PVM","PVM","PVM","PVM","PVM","PVM","PVM","PVM","PVM","PVM","PVM","PVM","PVM","PVM","PVM","PVM","PVM","PVM","PVM","PVM","PVM","PVM","PVM","PVM","PVM","PVM","PVM","PVM","PVM","PVM","PVM","PVM","PVM","PVM","PVM","PVM","PVM","PVM","PVM","PVM","PVM","PVM","PVM","PVM","PVM","PVM","PVM","PVM","PVM","PVM","PVM","PVM","PVM","PVM","PVM","PVM","PVM"]
["OSALLISTUJAN NIMI","SYNTYMÄVUOSI"]
[]
[]
[]
[]
[]
[]
[]
[]
[]
[]
[]
[]
[]
[]
[]
[]
[]
[]
[]
[]
[]
[]
[]
[]
[]
[]
[]
[]
[]
[]
[]
[]
[]
[]
[]
[]
[]
[]
[]
[null,null,null,null,null,null,null,null,null,null,null,null,null,null,null,null,null,null,null,null,null,null,null,null,null,null,null,null,null,null,null,null,null,null,null,null,null,null,null,null,null,null,null,null,null,null,null,null,null,null,null,null,null,null,null,null,null,null,null,null,null,null,null,null,null,null,null,null,null,null,null,null,null,null,null,null,null,null,null,null,null,null,null,null,null,null,null,null,null,null,null,null,null,null,null,null,null,null,null,null,null,null,null,null,null,null,"YHTEENSÄ"]
[null,"Yhteensä",{"$f":"COUNTA(C8:C47)","v":0},0,0,0,0,0,0,0,0,0,0,0,0,0,0,0,0,0,0,0,0,0,0,0,0,0,0,0,0,0,0,0,{"$f":"COUNTA(AI8:AI47)","v":0},0,0,0,0,0,0,0,0,0,0,0,0,0,0,0,0,0,0,0,0,0,0,0,0,0,0,0,0,0,0,0,{"$f":"COUNTA(BO8:BO47)","v":0},0,0,0,0,0,0,0,0,0,0,0,0,0,0,0,0,0,0,0,0,0,0,0,0,0,0,0,0,0,0,0,{"$f":"COUNTA(CU8:CU47)","v":0},0,0,0,0,0,0,0,{"$f":"SUM(C48:DB48)*B6","v":{"$error":"#N/A"}}]